{"text_format":"1","workbook":"xlsx","n_sheets":6,"sheets":["Maestra","Round Robin","Round Robin (3)","Round Robin (2)","Eliminación Sencilla","Hoja1"],"not_rendered":{"charts":0,"images":4,"macros":1,"external_links":0,"defined_names":14,"comments":1,"pivot_tables":0},"unopened":[],"bounds":{"document_bytes":16777216,"sheet_cells":100000,"rows_first":2000,"rows_last":500,"rows_between":2000,"halvings":0,"cell_chars":16384,"cell_head_chars":4096},"cells_cut":0,"cells_raw":0,"read":"whole","date_system":"1900"}

{"sheet":"Maestra","index":0,"n_rows":18,"n_cols":8,"rows_kept":18,"cut":false,"hidden":false,"merged":[]}
[null,null,"HOJA MAESTRA"]
[]
["ESTA HOJA LLENA EL ENCABEZAMIENTO DE TODAS LAS OTRAS, NO LA BORRE NI LA ELIMINE"]
["EN TODO ESTE ARCHIVO, ESCRIBA SOLO EN LAS AREAS GRISES"]
["CUANDO LLENE LAS AREAS GRISES DE ESTA HOJA, GUARDE COMO (Nombre que quiera darle) "]
["Y CONTINUE CON SU TRABAJO EN LAS OTRAS HOJAS. RECUERDE, EN TODAS LAS HOJAS, SÓLO PODRA"]
["ESCRIBIR EN LAS AREAS GRISES."]
["TORNEO",null,null,null,"CLASE",null,null,"CATEGORIA"]
[]
["2DO RANKING DEPARTAMENTAL 2020",null,null,null,"SENCILLOS ",null,null,"TERCERA"]
[]
["SEDE",null,null,null,"CIUDAD",null,null,"FECHA"]
[]
["LIGA SANTANDEREANA DE TENIS ",null,null,null,"BUCARAMANGA ",null,null,"17 OCT - 02 NOV"]
[null,null,null,null,null,null,null,"D/M/A"]
{"$rows_left_out":4}
{"sheet":"Round Robin","index":1,"n_rows":34,"n_cols":33,"rows_kept":34,"cut":false,"hidden":false,"merged":[[6,7,6,16]]}
[null,null,null,null,"SENCILLOS CUADRO DE ROUND ROBIN"]
["Torneo",null,null,null,{"$f":"Maestra!A10","v":"2DO RANKING DEPARTAMENTAL 2020"}]
["Sede",null,null,null,{"$f":"Maestra!A14","v":"LIGA SANTANDEREANA DE TENIS "}]
["Clase",null,null,null,{"$f":"Maestra!E10","v":"SENCILLOS "}]
["Ciudad",null,null,null,{"$f":"Maestra!E14","v":"BUCARAMANGA "}]
["Categoría",null,null,null,{"$f":"Maestra!H10","v":"TERCERA"}]
["Fecha",null,{"$f":"Maestra!H14","v":"17 OCT - 02 NOV"},null,null,null,null,"COORDINADORA",null,null,null,null,null,null,null,null,null,null,null,null,null,null,null,null,null,null,null,null,null,{"$f":"Maestra!A18","v":"PAOLA A CHINCHILLA "}]
[null,null,"CUADRO NO. 1"]
["N°","Rank","NOMBRE",null,"Liga",null,null,null,1,null,null,null,null,null,2,null,null,null,null,null,3,null,null,null,null,null,4,null,null,"PUNTOS","% SETS","% GAMES","PUESTO"]
[1,{"$f":"UPPER(IF($D10=\"\",\"\",VLOOKUP($D10,#REF!,7)))","v":""},"ANDRES ALMEYDA ORTIZ",null,"PN",null,null,null,null,null,null,4,6,6,1,8,10,6,0,6,0,null,null,null,null,null,null,null,null,null,{"$f":"((IF(AND(R10>5,S10<7),1,0)+IF(AND(T10>5,U10<7),1,0)+IF(AND(V10>5,W10<7),1,0)+IF(AND(L10>5,M10<7),1,0)+IF(AND(N10>5,O10<7),1,0)+IF(AND(P10>5,Q10<7),1,0)+IF(AND(X10>5,Y10<7),1,0)+IF(AND(Z10>5,AA10<7),1,0)+IF(AND(AB10>5,AC10<7),1,0))/(COUNTIF(R10,\">=0\")+COUNTIF(T10,\">=0\")+COUNTIF(V10,\">=0\")+COUNTIF(X10,\">=0\")+COUNTIF(Z10,\">=0\")+COUNTIF(AB10,\">=0\")++COUNTIF(L10,\">=0\")+COUNTIF(N10,\">=0\")+COUNTIF(P10,\">=0\")))*100","v":60},{"$f":"((L10+N10+P10+R10+T10+V10+X10+Z10+AB10)/(L10+M10+N10+O10+P10+Q10+R10+S10+T10+U10+V10+W10+X10+Y10+Z10+AA10+AB10+AC10))*100","v":63.829787234042556}]
[2,{"$f":"UPPER(IF($D11=\"\",\"\",VLOOKUP($D11,#REF!,7)))","v":""},"SEIDER GUTIERREZ CORTES ",null,"UTS",6,4,1,6,10,8,null,null,null,null,null,null,3,6,6,4,10,4,6,1,6,1,null,null,null,{"$f":"((IF(AND(F11>5,G11<7),1,0)+IF(AND(H11>5,I11<7),1,0)+IF(AND(J11>5,K11<7),1,0)+IF(AND(R11>5,S11<7),1,0)+IF(AND(T11>5,U11<7),1,0)+IF(AND(V11>5,W11<7),1,0)+IF(AND(X11>5,Y11<7),1,0)+IF(AND(Z11>5,AA11<7),1,0)+IF(AND(AB11>5,AC11<7),1,0))/(COUNTIF(F11,\">=0\")+COUNTIF(H11,\">=0\")+COUNTIF(J11,\">=0\")+COUNTIF(X11,\">=0\")+COUNTIF(Z11,\">=0\")+COUNTIF(AB11,\">=0\")+COUNTIF(R11,\">=0\")+COUNTIF(T11,\">=0\")+COUNTIF(V11,\">=0\")))*100","v":62.5},{"$f":"((F11+J11+H11+R11+T11+V11+X11+Z11+AB11)/(F11+G11+H11+I11+J11+K11+R11+S11+T11+U11+V11+W11+X11+Y11+Z11+AA11+AB11+AC11))*100","v":58.536585365853654}]
[3,{"$f":"UPPER(IF($D12=\"\",\"\",VLOOKUP($D12,#REF!,7)))","v":""},"OSCAR ANDRES QUINTERO ",null,"IND",0,6,0,6,null,null,6,3,4,6,4,10,null,null,null,null,null,null,6,2,6,0,null,null,null,{"$f":"((IF(AND(F12>5,G12<7),1,0)+IF(AND(H12>5,I12<7),1,0)+IF(AND(J12>5,K12<7),1,0)+IF(AND(L12>5,M12<7),1,0)+IF(AND(N12>5,O12<7),1,0)+IF(AND(P12>5,Q12<7),1,0)+IF(AND(X12>5,Y12<7),1,0)+IF(AND(Z12>5,AA12<7),1,0)+IF(AND(AB12>5,AC12<7),1,0))/(COUNTIF(F12,\">=0\")+COUNTIF(H12,\">=0\")+COUNTIF(J12,\">=0\")+COUNTIF(X12,\">=0\")+COUNTIF(Z12,\">=0\")+COUNTIF(AB12,\">=0\")+COUNTIF(L12,\">=0\")+COUNTIF(N12,\">=0\")+COUNTIF(P12,\">=0\")))*100","v":42.857142857142854},{"$f":"((F12+J12+H12+L12+N12+P12+X12+Z12+AB12)/(F12+G12+H12+I12+J12+K12+L12+M12+N12+O12+P12+Q12+X12+Y12+Z12+AA12+AB12+AC12))*100","v":44.067796610169488}]
[4,{"$f":"UPPER(IF($D13=\"\",\"\",VLOOKUP($D13,#REF!,7)))","v":""},"ANDRES ALDANA OJEDA ",null,"UNAB",null,null,null,null,null,null,1,6,1,6,null,null,2,6,0,6,null,null,null,null,null,null,null,null,null,{"$f":"((IF(AND(F13>5,G13<7),1,0)+IF(AND(H13>5,I13<7),1,0)+IF(AND(J13>5,K13<7),1,0)+IF(AND(L13>5,M13<7),1,0)+IF(AND(N13>5,O13<7),1,0)+IF(AND(P13>5,Q13<7),1,0)+IF(AND(R13>5,S13<7),1,0)+IF(AND(T13>5,U13<7),1,0)+IF(AND(V13>5,W13<7),1,0))/(COUNTIF(F13,\">=0\")+COUNTIF(H13,\">=0\")+COUNTIF(J13,\">=0\")+COUNTIF(R13,\">=0\")+COUNTIF(T13,\">=0\")+COUNTIF(V13,\">=0\")++COUNTIF(L13,\">=0\")+COUNTIF(N13,\">=0\")+COUNTIF(P13,\">=0\")))*100","v":0},{"$f":"((F13+J13+H13+L13+N13+P13+R13+T13+V13)/(F13+G13+H13+I13+J13+K13+L13+M13+N13+O13+P13+Q13+R13+S13+T13+U13+V13+W13))*100","v":14.285714285714285}]
[]
[null,null,"CUADRO NO. 2"]
{"$rows_left_out":20}
{"sheet":"Round Robin (3)","index":2,"n_rows":34,"n_cols":33,"rows_kept":34,"cut":false,"hidden":false,"merged":[[6,7,6,16]]}
[null,null,null,null,"SENCILLOS CUADRO DE ROUND ROBIN"]
["Torneo",null,null,null,{"$f":"Maestra!A10","v":"2DO RANKING DEPARTAMENTAL 2020"}]
["Sede",null,null,null,{"$f":"Maestra!A14","v":"LIGA SANTANDEREANA DE TENIS "}]
["Clase",null,null,null,{"$f":"Maestra!E10","v":"SENCILLOS "}]
["Ciudad",null,null,null,{"$f":"Maestra!E14","v":"BUCARAMANGA "}]
["Categoría",null,null,null,{"$f":"Maestra!H10","v":"TERCERA"}]
["Fecha",null,{"$f":"Maestra!H14","v":"17 OCT - 02 NOV"},null,null,null,null,"COORDINADORA",null,null,null,null,null,null,null,null,null,null,null,null,null,null,null,null,null,null,null,null,null,{"$f":"Maestra!A18","v":"PAOLA A CHINCHILLA "}]
[null,null,"CUADRO NO. 5"]
["N°","Rank","NOMBRE",null,"Liga",null,null,null,1,null,null,null,null,null,2,null,null,null,null,null,3,null,null,null,null,null,4,null,null,"PUNTOS","% SETS","% GAMES","PUESTO"]
[17,null,"ANDRES FERNANDO PEÑA ",null,"CU",null,null,null,null,null,null,6,7,2,6,null,null,6,3,1,6,9,10,null,null,null,null,null,null,null,{"$f":"((IF(AND(R10>5,S10<7),1,0)+IF(AND(T10>5,U10<7),1,0)+IF(AND(V10>5,W10<7),1,0)+IF(AND(L10>5,M10<7),1,0)+IF(AND(N10>5,O10<7),1,0)+IF(AND(P10>5,Q10<7),1,0)+IF(AND(X10>5,Y10<7),1,0)+IF(AND(Z10>5,AA10<7),1,0)+IF(AND(AB10>5,AC10<7),1,0))/(COUNTIF(R10,\">=0\")+COUNTIF(T10,\">=0\")+COUNTIF(V10,\">=0\")+COUNTIF(X10,\">=0\")+COUNTIF(Z10,\">=0\")+COUNTIF(AB10,\">=0\")++COUNTIF(L10,\">=0\")+COUNTIF(N10,\">=0\")+COUNTIF(P10,\">=0\")))*100","v":20},{"$f":"((L10+N10+P10+R10+T10+V10+X10+Z10+AB10)/(L10+M10+N10+O10+P10+Q10+R10+S10+T10+U10+V10+W10+X10+Y10+Z10+AA10+AB10+AC10))*100","v":42.857142857142854}]
[18,null,"OSCAR MERCHAN MENDEZ",null,"IND",7,6,6,2,null,null,null,null,null,null,null,null,null,null,null,null,null,null,1,6,0,6,null,null,null,{"$f":"((IF(AND(F11>5,G11<7),1,0)+IF(AND(H11>5,I11<7),1,0)+IF(AND(J11>5,K11<7),1,0)+IF(AND(R11>5,S11<7),1,0)+IF(AND(T11>5,U11<7),1,0)+IF(AND(V11>5,W11<7),1,0)+IF(AND(X11>5,Y11<7),1,0)+IF(AND(Z11>5,AA11<7),1,0)+IF(AND(AB11>5,AC11<7),1,0))/(COUNTIF(F11,\">=0\")+COUNTIF(H11,\">=0\")+COUNTIF(J11,\">=0\")+COUNTIF(X11,\">=0\")+COUNTIF(Z11,\">=0\")+COUNTIF(AB11,\">=0\")+COUNTIF(R11,\">=0\")+COUNTIF(T11,\">=0\")+COUNTIF(V11,\">=0\")))*100","v":50},{"$f":"((F11+J11+H11+R11+T11+V11+X11+Z11+AB11)/(F11+G11+H11+I11+J11+K11+R11+S11+T11+U11+V11+W11+X11+Y11+Z11+AA11+AB11+AC11))*100","v":41.17647058823529}]
[19,null,"SERGIO MARQUEZ ",null,"FT",3,6,6,1,10,9,null,null,null,null,null,null,null,null,null,null,null,null,2,6,2,6,null,null,null,{"$f":"((IF(AND(F12>5,G12<7),1,0)+IF(AND(H12>5,I12<7),1,0)+IF(AND(J12>5,K12<7),1,0)+IF(AND(L12>5,M12<7),1,0)+IF(AND(N12>5,O12<7),1,0)+IF(AND(P12>5,Q12<7),1,0)+IF(AND(X12>5,Y12<7),1,0)+IF(AND(Z12>5,AA12<7),1,0)+IF(AND(AB12>5,AC12<7),1,0))/(COUNTIF(F12,\">=0\")+COUNTIF(H12,\">=0\")+COUNTIF(J12,\">=0\")+COUNTIF(X12,\">=0\")+COUNTIF(Z12,\">=0\")+COUNTIF(AB12,\">=0\")+COUNTIF(L12,\">=0\")+COUNTIF(N12,\">=0\")+COUNTIF(P12,\">=0\")))*100","v":20},{"$f":"((F12+J12+H12+L12+N12+P12+X12+Z12+AB12)/(F12+G12+H12+I12+J12+K12+L12+M12+N12+O12+P12+Q12+X12+Y12+Z12+AA12+AB12+AC12))*100","v":45.098039215686278}]
[20,null,"ROQUE PARRA SIERRA ",null,"ACET",null,null,null,null,null,null,6,1,6,0,null,null,6,2,6,2,null,null,null,null,null,null,null,null,null,{"$f":"((IF(AND(F13>5,G13<7),1,0)+IF(AND(H13>5,I13<7),1,0)+IF(AND(J13>5,K13<7),1,0)+IF(AND(L13>5,M13<7),1,0)+IF(AND(N13>5,O13<7),1,0)+IF(AND(P13>5,Q13<7),1,0)+IF(AND(R13>5,S13<7),1,0)+IF(AND(T13>5,U13<7),1,0)+IF(AND(V13>5,W13<7),1,0))/(COUNTIF(F13,\">=0\")+COUNTIF(H13,\">=0\")+COUNTIF(J13,\">=0\")+COUNTIF(R13,\">=0\")+COUNTIF(T13,\">=0\")+COUNTIF(V13,\">=0\")++COUNTIF(L13,\">=0\")+COUNTIF(N13,\">=0\")+COUNTIF(P13,\">=0\")))*100","v":100},{"$f":"((F13+J13+H13+L13+N13+P13+R13+T13+V13)/(F13+G13+H13+I13+J13+K13+L13+M13+N13+O13+P13+Q13+R13+S13+T13+U13+V13+W13))*100","v":82.758620689655174}]
[]
[null,null,"CUADRO NO. 6"]
{"$rows_left_out":20}
{"sheet":"Round Robin (2)","index":3,"n_rows":35,"n_cols":39,"rows_kept":35,"cut":false,"hidden":false,"merged":[[6,7,6,16]]}
[null,null,null,null,"SENCILLOS CUADRO DE ROUND ROBIN"]
["Torneo",null,null,null,{"$f":"Maestra!A10","v":"2DO RANKING DEPARTAMENTAL 2020"}]
["Sede",null,null,null,{"$f":"Maestra!A14","v":"LIGA SANTANDEREANA DE TENIS "}]
["Clase",null,null,null,{"$f":"Maestra!E10","v":"SENCILLOS "}]
["Ciudad",null,null,null,{"$f":"Maestra!E14","v":"BUCARAMANGA "}]
["Categoría",null,null,null,{"$f":"Maestra!H10","v":"TERCERA"}]
["Fecha",null,{"$f":"Maestra!H14","v":"17 OCT - 02 NOV"},null,null,null,null,"COORDINADORA",null,null,null,null,null,null,null,null,null,null,null,null,null,null,null,null,null,null,null,null,null,null,null,null,null,null,null,{"$f":"Maestra!A18","v":"PAOLA A CHINCHILLA "}]
[null,null,"CUADRO NO. 9"]
["N°","Rank","NOMBRE",null,"Liga",null,null,null,1,null,null,null,null,null,2,null,null,null,null,null,3,null,null,null,null,null,4,null,null,null,null,null,5,null,null,"PUNTOS","% SETS","% GAMES","PUESTO"]
[33,null,"DANIEL FERNANDO NIÑO",null,"IND",null,null,null,null,null,null,2,6,0,6,null,null,null,null,null,null,null,null,6,1,6,1,null,null,null,null,null,null,null,null,null,{"$f":"((IF(AND(R10>5,S10<7),1,0)+IF(AND(T10>5,U10<7),1,0)+IF(AND(V10>5,W10<7),1,0)+IF(AND(L10>5,M10<7),1,0)+IF(AND(N10>5,O10<7),1,0)+IF(AND(P10>5,Q10<7),1,0)+IF(AND(X10>5,Y10<7),1,0)+IF(AND(Z10>5,AA10<7),1,0)+IF(AND(AB10>5,AC10<7),1,0))/(COUNTIF(R10,\">=0\")+COUNTIF(T10,\">=0\")+COUNTIF(V10,\">=0\")+COUNTIF(X10,\">=0\")+COUNTIF(Z10,\">=0\")+COUNTIF(AB10,\">=0\")++COUNTIF(L10,\">=0\")+COUNTIF(N10,\">=0\")+COUNTIF(P10,\">=0\")))*100","v":50},{"$f":"((L10+N10+P10+R10+T10+V10+X10+Z10+AB10)/(L10+M10+N10+O10+P10+Q10+R10+S10+T10+U10+V10+W10+X10+Y10+Z10+AA10+AB10+AC10))*100","v":50}]
[34,null,"ISABELLA PALLARES AMAYA ",null,"ACET",6,2,6,0,null,null,null,null,null,null,null,null,null,null,null,null,null,null,null,null,null,null,null,null,6,0,4,6,7,10,null,{"$f":"((IF(AND(F11>5,G11<7),1,0)+IF(AND(H11>5,I11<7),1,0)+IF(AND(J11>5,K11<7),1,0)+IF(AND(R11>5,S11<7),1,0)+IF(AND(T11>5,U11<7),1,0)+IF(AND(V11>5,W11<7),1,0)+IF(AND(X11>5,Y11<7),1,0)+IF(AND(Z11>5,AA11<7),1,0)+IF(AND(AB11>5,AC11<7),1,0))/(COUNTIF(F11,\">=0\")+COUNTIF(H11,\">=0\")+COUNTIF(J11,\">=0\")+COUNTIF(X11,\">=0\")+COUNTIF(Z11,\">=0\")+COUNTIF(AB11,\">=0\")+COUNTIF(R11,\">=0\")+COUNTIF(T11,\">=0\")+COUNTIF(V11,\">=0\")))*100","v":100},{"$f":"((F11+J11+H11+R11+T11+V11+X11+Z11+AB11)/(F11+G11+H11+I11+J11+K11+R11+S11+T11+U11+V11+W11+X11+Y11+Z11+AA11+AB11+AC11))*100","v":85.714285714285708}]
[35,null,"RAFAEL ACEVEDO FRANCO",null,"VS",null,null,null,null,null,null,null,null,null,null,null,null,null,null,null,null,null,null,6,7,6,4,10,7,null,null,null,null,null,null,null,{"$f":"((IF(AND(F12>5,G12<7),1,0)+IF(AND(H12>5,I12<7),1,0)+IF(AND(J12>5,K12<7),1,0)+IF(AND(L12>5,M12<7),1,0)+IF(AND(N12>5,O12<7),1,0)+IF(AND(P12>5,Q12<7),1,0)+IF(AND(X12>5,Y12<7),1,0)+IF(AND(Z12>5,AA12<7),1,0)+IF(AND(AB12>5,AC12<7),1,0))/(COUNTIF(F12,\">=0\")+COUNTIF(H12,\">=0\")+COUNTIF(J12,\">=0\")+COUNTIF(X12,\">=0\")+COUNTIF(Z12,\">=0\")+COUNTIF(AB12,\">=0\")+COUNTIF(L12,\">=0\")+COUNTIF(N12,\">=0\")+COUNTIF(P12,\">=0\")))*100","v":33.333333333333329},{"$f":"((F12+J12+H12+L12+N12+P12+X12+Z12+AB12)/(F12+G12+H12+I12+J12+K12+L12+M12+N12+O12+P12+Q12+X12+Y12+Z12+AA12+AB12+AC12))*100","v":55.000000000000007}]
[36,null,"OSCAR SANTIAGO CASTIBLANCO ",null,"LT",1,6,1,6,null,null,null,null,null,null,null,null,7,6,4,6,7,10,null,null,null,null,null,null,null,null,null,null,null,null,null,{"$f":"((IF(AND(F13>5,G13<7),1,0)+IF(AND(H13>5,I13<7),1,0)+IF(AND(J13>5,K13<7),1,0)+IF(AND(L13>5,M13<7),1,0)+IF(AND(N13>5,O13<7),1,0)+IF(AND(P13>5,Q13<7),1,0)+IF(AND(R13>5,S13<7),1,0)+IF(AND(T13>5,U13<7),1,0)+IF(AND(V13>5,W13<7),1,0))/(COUNTIF(F13,\">=0\")+COUNTIF(H13,\">=0\")+COUNTIF(J13,\">=0\")+COUNTIF(R13,\">=0\")+COUNTIF(T13,\">=0\")+COUNTIF(V13,\">=0\")++COUNTIF(L13,\">=0\")+COUNTIF(N13,\">=0\")+COUNTIF(P13,\">=0\")))*100","v":20},{"$f":"((F13+J13+H13+L13+N13+P13+R13+T13+V13)/(F13+G13+H13+I13+J13+K13+L13+M13+N13+O13+P13+Q13+R13+S13+T13+U13+V13+W13))*100","v":37.037037037037038}]
[37,null,"JUAN MARTIN LOPEZ",null,"CC",null,null,null,null,null,null,0,6,6,4,10,7,null,null,null,null,null,null,null,null,null,null,null,null,null,null,null,null,null,null,null,{"$f":"((IF(AND(F14>5,G14<7),1,0)+IF(AND(H14>5,I14<7),1,0)+IF(AND(J14>5,K14<7),1,0)+IF(AND(L14>5,M14<7),1,0)+IF(AND(N14>5,O14<7),1,0)+IF(AND(P14>5,Q14<7),1,0)+IF(AND(R14>5,S14<7),1,0)+IF(AND(T14>5,U14<7),1,0)+IF(AND(V14>5,W14<7),1,0))/(COUNTIF(F14,\">=0\")+COUNTIF(H14,\">=0\")+COUNTIF(J14,\">=0\")+COUNTIF(R14,\">=0\")+COUNTIF(T14,\">=0\")+COUNTIF(V14,\">=0\")++COUNTIF(L14,\">=0\")+COUNTIF(N14,\">=0\")+COUNTIF(P14,\">=0\")))*100","v":33.333333333333329},{"$f":"((F14+J14+H14+L14+N14+P14+R14+T14+V14)/(F14+G14+H14+I14+J14+K14+L14+M14+N14+O14+P14+Q14+R14+S14+T14+U14+V14+W14))*100","v":48.484848484848484}]
[]
{"$rows_left_out":21}
{"sheet":"Eliminación Sencilla","index":4,"n_rows":70,"n_cols":14,"rows_kept":70,"cut":false,"hidden":false,"merged":[[26,11,26,12],[18,11,18,12],[1,1,1,4],[10,11,10,12],[12,15,12,16],[14,11,14,12],[22,11,22,12],[58,11,58,12],[62,11,62,12],[65,9,65,10],[32,13,32,14],[34,11,34,12],[38,11,38,12],[46,11,46,12],[50,11,50,12]]}
[null,null,null,null,null,null,null,"SENCILLOS CUADRO PRINCIPAL"]
["Torneo","2DO RANKING DEPARTAMENTAL 2020",null,null,null,"Clase",null,"Sencillos",null,null,null,"Categoría",null,"3RA"]
["Sede","Liga Santandereana de Tenis ",null,null,null,"Ciudad",null,"Bucaramanga",null,null,null,"Fecha",null,"2020-10-17"]
[]
[1,{"$f":"UPPER(IF($D5=\"\",\"\",VLOOKUP($D5,#REF!,6)))","v":""},{"$f":"UPPER(IF($D5=\"\",\"\",VLOOKUP($D5,#REF!,7)))","v":""}]
[2,{"$f":"UPPER(IF($D6=\"\",\"\",VLOOKUP($D6,#REF!,6)))","v":""},{"$f":"UPPER(IF($D6=\"\",\"\",VLOOKUP($D6,#REF!,7)))","v":""}]
[3,{"$f":"UPPER(IF($D7=\"\",\"\",VLOOKUP($D7,#REF!,6)))","v":""},{"$f":"UPPER(IF($D7=\"\",\"\",VLOOKUP($D7,#REF!,7)))","v":""}]
[4,{"$f":"UPPER(IF($D8=\"\",\"\",VLOOKUP($D8,#REF!,6)))","v":""},{"$f":"UPPER(IF($D8=\"\",\"\",VLOOKUP($D8,#REF!,7)))","v":""}]
[5,{"$f":"UPPER(IF($D9=\"\",\"\",VLOOKUP($D9,#REF!,6)))","v":""},{"$f":"UPPER(IF($D9=\"\",\"\",VLOOKUP($D9,#REF!,7)))","v":""}]
[6,{"$f":"UPPER(IF($D10=\"\",\"\",VLOOKUP($D10,#REF!,6)))","v":""},{"$f":"UPPER(IF($D10=\"\",\"\",VLOOKUP($D10,#REF!,7)))","v":""}]
[7,{"$f":"UPPER(IF($D11=\"\",\"\",VLOOKUP($D11,#REF!,6)))","v":""},{"$f":"UPPER(IF($D11=\"\",\"\",VLOOKUP($D11,#REF!,7)))","v":""}]
[8,{"$f":"UPPER(IF($D12=\"\",\"\",VLOOKUP($D12,#REF!,6)))","v":""},{"$f":"UPPER(IF($D12=\"\",\"\",VLOOKUP($D12,#REF!,7)))","v":""}]
[9,{"$f":"UPPER(IF($D13=\"\",\"\",VLOOKUP($D13,#REF!,6)))","v":""},{"$f":"UPPER(IF($D13=\"\",\"\",VLOOKUP($D13,#REF!,7)))","v":""}]
[10,{"$f":"UPPER(IF($D14=\"\",\"\",VLOOKUP($D14,#REF!,6)))","v":""},{"$f":"UPPER(IF($D14=\"\",\"\",VLOOKUP($D14,#REF!,7)))","v":""}]
[11,{"$f":"UPPER(IF($D15=\"\",\"\",VLOOKUP($D15,#REF!,6)))","v":""},{"$f":"UPPER(IF($D15=\"\",\"\",VLOOKUP($D15,#REF!,7)))","v":""}]
{"$rows_left_out":56}
{"sheet":"Hoja1","index":5,"n_rows":0,"n_cols":0,"rows_kept":0,"cut":false,"hidden":false,"merged":[]}